Welcome, Guest
Username: Password: Remember me
Lab CT Version, news, test results, new features request and suggestions
  • Page:
  • 1
  • 2

TOPIC:

CT LAB ver 5.20 8 years 4 weeks ago #6227

  • Sternas Stefanos
  • Sternas Stefanos's Avatar Topic Author
  • Offline
  • Moderator
  • Moderator
  • Ex Pilot, M.Sc, Ph.D
  • Posts: 4426
  • Thank you received: 1072


---- CT Release 5.20 LAB Tasks list ----

-Task10 Port CT to MacOS X (Total Steps 5)
-Task20 Update CT Scripts (Total Steps 3)
-Task30 pl_AsphyreSphinx, Port to QT, Carbon, Cocoa etc (Total Steps 5)
-Task31 pl_GLScene, Port to QT, Carbon, Cocoa etc (Total Steps 5)
-Task32 pl_OnGuard, Update, test and fix (Total Steps 3)


02-12-2014 Revision: 005131 LAB Actions

--04-11-2014 Update pl_GLScene to SVN Rev 6475, remove old OpenGL1x.pas and Add arm-linux support (Task31: Step 1 for 5)
--05-11-2014 Update pl_OnGuard and Add CodeOcean samples (Task32: Step 1 for 3)
--09-11-2014 ADD Support for Ubuntu 14.10
--10-11-2014 Update CT Scripts, fix some problems on FreeBSD (Task20: Step 1 for 3)
--11-11-2014 Synchronize with Lazarus SVN Rev 46797
--15-11-2014 Update FPC to SVN Rev 29075
--15-11-2014 ADD Support for OpenSuse 13.2 Linux (MultiArch on GTK and QT)
--19-11-2014 Update many Typhon Packages to support MacOS
--19-11-2014 ADD LIMITED Support for Mac OS X platform Carbon 32 bits (Task10: Step 1 for 5)
--20-11-2014 Update CTCenter, move Libraries Tab to a new Dialog
--23-11-2014 Update CT Scripts, new Typhon Tools build procedure (Task20: Step 2 for 3)
--24-11-2014 Update pl_GLScene to SVN Rev 6509 , many changes to files names..
--23-11-2014 Update pl_OpenGL to Ver 6.2.1
--23-11-2014 Update pl_AsphyreSphinx to Ver 4.1.1 (Task30: Step 1 of 5)
--23-11-2014 Update FPC to SVN Rev 29116
--26-11-2014 Update pl_BGRAbitmap to SVN Rev 947
--26-11-2014 Update pl_PascalSCADA to SVN Rev 912
--26-11-2014 Update pl_Indy to SVN Rev 5213
--26-11-2014 Update pl_ZeosDBO to SVN Rev 3502
--26-11-2014 Update pl_SpkToolBar to SVN Rev 3786
--26-11-2014 Update pl_WST to SVN Rev 3786
--26-11-2014 Update pl_RX to SVN Rev 3786
--26-11-2014 Update pl_FPSpreadsheet to SVN Rev 3786
--26-11-2014 Update pl_RichMemo to SVN Rev 3786
--27-11-2014 Synchronize with Lazarus SVN Rev 46997
--28-11-2014 Start MEGA-BUILD Cyrcle
--01-12-2014 Synchronize with Lazarus SVN Rev 47049
--02-12-2014 Finish MEGA-BUILD Cyrcle

Note1: You can download and test this version from "CTCenter->Update Manager" and select CT Development Version
Note2: Please post to this topic any suggestion or problem or fix for LAB CT ver 5.20
PilotLogic Architect and Core Programmer
Attachments:

Please Log in or Create an account to join the conversation.

Last edit: by Sternas Stefanos.

CT LAB ver 5.20 8 years 3 weeks ago #6250

  • Angelo Mangiaracina
  • Angelo Mangiaracina's Avatar
  • Offline
  • Junior Member
  • Junior Member
  • Posts: 57
  • Thank you received: 0
Hi, I trayed but the packages version for development version are still 5.10 the same already installed.
What version of Fpc are you using? I saw that the problem of character unit missing in wince has been resolved just in recent days.

Please Log in or Create an account to join the conversation.

CT LAB ver 5.20 8 years 3 weeks ago #6251

  • Sternas Stefanos
  • Sternas Stefanos's Avatar Topic Author
  • Offline
  • Moderator
  • Moderator
  • Ex Pilot, M.Sc, Ph.D
  • Posts: 4426
  • Thank you received: 1072
Sir we don't release CT 5.20 LAB yet
We must first close the last updates problems
and to make a BIG build (quick build and test in all host OSes, Win, Lin, Bsd , Sol etc),
We are in FreeBSD 32bit (MATE desktop with Typhon32 for QT) now...
ETA 2-3 days
PilotLogic Architect and Core Programmer
Attachments:

Please Log in or Create an account to join the conversation.

Last edit: by Sternas Stefanos.

CT LAB ver 5.20 8 years 1 week ago #6400

  • Sternas Stefanos
  • Sternas Stefanos's Avatar Topic Author
  • Offline
  • Moderator
  • Moderator
  • Ex Pilot, M.Sc, Ph.D
  • Posts: 4426
  • Thank you received: 1072
We prepare LAB CT 5.20 (Revision: 005130) Develop Release
ETA: 1-2 days if all ok
PilotLogic Architect and Core Programmer
The following user(s) said Thank You: FredyCC, zbyna, Crash, Matteo Riso

Please Log in or Create an account to join the conversation.

CT LAB ver 5.20 8 years 1 week ago #6403

  • FredyCC
  • FredyCC's Avatar
  • Offline
  • Junior Member
  • Junior Member
  • Database/Developer
  • Posts: 60
  • Thank you received: 10
Great news Sternas, great work from your team :) , just a question, does this version include support for MacOS? :woohoo:

Thank you

Please Log in or Create an account to join the conversation.

CT LAB ver 5.20 8 years 6 days ago #6404

  • Matteo Riso
  • Matteo Riso's Avatar
  • Offline
  • New Member
  • New Member
  • ZipGenius developer
  • Posts: 17
  • Thank you received: 0
:woohoo: great news! Is there a changelog anywhere that tells what is going to be fixed or changed in CT 5.20?
ZipGenius - the free file compression suite for Windows (and Linux soon).

Please Log in or Create an account to join the conversation.

CT LAB ver 5.20 8 years 6 days ago #6405

  • Sternas Stefanos
  • Sternas Stefanos's Avatar Topic Author
  • Offline
  • Moderator
  • Moderator
  • Ex Pilot, M.Sc, Ph.D
  • Posts: 4426
  • Thank you received: 1072
Yes this version has limited support to Mac OS,
Typhon32 BigIDE for Carbon and CTCenter32 for Carbon are working OK.

Guys, we are at Step 2 of 5.
It's the second step, after basic support (first step).

-We change and port many components code to MAC
-We modify CT scripts for MAC
-etc

Until Now:
-ADD Support for Ubuntu 14.10
-ADD Support for OpenSuse 13.2 Linux (MultiArch for GTK and QT)
-Update All CT Scripts
-Update pl_GLScene Source (24-11-2014 SVN Rev 6509 ) // and Add arm-linux support, many changes to files names..
-Update pl_BGRAbitmap Source (26-11-2014 SVN Rev 947 )
-Update pl_PascalSCADA Source (26-11-2014 SVN Rev 912 )
-Update pl_Indy Source (26-11-2014 SVN Rev 5213 )
-Update pl_ZeosDBO Source (26-11-2014 SVN Rev 3502 )
-Update pl_SpkToolBar Source (26-11-2014 SVN Rev 3786 )
-Update pl_WST Source (26-11-2014 SVN Rev 3786 )
-Update pl_RX Source (26-11-2014 SVN Rev 3786 )
-Update pl_FPSpreadsheet Source (26-11-2014 SVN Rev 3786 )
-Update pl_RichMemo Source (26-11-2014 SVN Rev 3786 )
-Update pl_OnGuard to Ver 5.1.4 (and Add CodeOcean samples)
-Update pl_OpenGL to Ver 6.2.1
-Update pl_AsphyreSphinx to Ver 4.1.1
PilotLogic Architect and Core Programmer
The following user(s) said Thank You: FredyCC, kenlee, Ahmad

Please Log in or Create an account to join the conversation.

Last edit: by Sternas Stefanos.

CT LAB ver 5.20 8 years 3 days ago #6417

  • Angelo Mangiaracina
  • Angelo Mangiaracina's Avatar
  • Offline
  • Junior Member
  • Junior Member
  • Posts: 57
  • Thank you received: 0
Hi, sternas may you please say what release of free pascal compiler will be used in 5.20?

Please Log in or Create an account to join the conversation.

CT LAB ver 5.20 8 years 2 days ago #6435

  • Sternas Stefanos
  • Sternas Stefanos's Avatar Topic Author
  • Offline
  • Moderator
  • Moderator
  • Ex Pilot, M.Sc, Ph.D
  • Posts: 4426
  • Thank you received: 1072
Sir
FreePascal 2.7.1 Source 23-11-2014 SVN Rev 29116

tested on:
Win32, win64,
Linux32, Linux64,
FreeBSD32, FreeBSD64,
Solaris32, Solaris64
OpenIndiana32, OpenIndiana64,
MacOS32 , MacOS64
PilotLogic Architect and Core Programmer

Please Log in or Create an account to join the conversation.

Last edit: by Sternas Stefanos.

CT LAB ver 5.20 8 years 2 days ago #6439

  • Sternas Stefanos
  • Sternas Stefanos's Avatar Topic Author
  • Offline
  • Moderator
  • Moderator
  • Ex Pilot, M.Sc, Ph.D
  • Posts: 4426
  • Thank you received: 1072
02-12-2014: We release Lab CT 5.20 Revision: 005131
changes log at topic first page

Please test and report here
PilotLogic Architect and Core Programmer

Please Log in or Create an account to join the conversation.

CT LAB ver 5.20 8 years 2 days ago #6440

  • Alexandr
  • Alexandr's Avatar
  • Offline
  • Junior Member
  • Junior Member
  • Posts: 62
  • Thank you received: 2
Greetings!

OS: Windows 8.1 x64 (UAC active, Smart-Screen active, ESET NOD32 v8 installed)
FPC version: 2.6.4 as standalone instalation(e.g. d:\FPC\2.6.4\*)

I've downloaded your not stable release of CT v.5.20 via internal updating.
After all preparations, in setup CMD I've select "Remove and rebuild ALL".
All most is ok, but.. I can't build BigIDE versions in both architectures(32, 64), see attached log files from CT.
The same errors I've got from CT.

I've launched IDE, and rebuild it with "Optimized IDE" profile. After that I see BigIDE(Overall packages are installed) witout any problems.

But some strange happens:
1. At first time I've rebuild IDE, it was aoto-restart. The pallete views like SmallIDE, but al packages are installed.
2. Close IDE, start it by it self, I see, that's pallete components is OK.


Thanks!

Sorry for language mistakes.

Please Log in or Create an account to join the conversation.

CT LAB ver 5.20 8 years 2 days ago #6443

  • Sternas Stefanos
  • Sternas Stefanos's Avatar Topic Author
  • Offline
  • Moderator
  • Moderator
  • Ex Pilot, M.Sc, Ph.D
  • Posts: 4426
  • Thank you received: 1072
Sir CT use the latest SVN FPC 2.7.1 NOT FPC 2.6.4
are NOT the same

Please remove any other FPC ver

Hint: (11031) End of reading config file D:\FPC\2.6.4\bin\i386-Win32\fpc.cfg
PilotLogic Architect and Core Programmer

Please Log in or Create an account to join the conversation.

Last edit: by Sternas Stefanos.

CT LAB ver 5.20 8 years 2 days ago #6447

  • Alexandr
  • Alexandr's Avatar
  • Offline
  • Junior Member
  • Junior Member
  • Posts: 62
  • Thank you received: 2
Ok, but why rebuilding from V-IDE(rebuild with Optimized IDE profile) into BigIDE works in both architectures(32,86)?

Where I can get the really latest FPC version?
Or how to build FPC from SVN sources?

Please Log in or Create an account to join the conversation.

Last edit: by Alexandr.

CT LAB ver 5.20 8 years 1 day ago #6451

  • avra
  • avra's Avatar
  • Visitor
  • Visitor

arhangelsoft wrote: Where I can get the really latest FPC version?
Or how to build FPC from SVN sources?


You can use FPCUP for this. It helps me for example to have all these on the same pc:
1. FPC 2.6.4 + LAZ SVN
2. FPC SVN + LAZ SVN
3. CT 5.1

Please Log in or Create an account to join the conversation.

Last edit: by avra.

CT LAB ver 5.20 8 years 1 day ago #6452

  • Alexandr
  • Alexandr's Avatar
  • Offline
  • Junior Member
  • Junior Member
  • Posts: 62
  • Thank you received: 2
no, thanks.. I'm already build FPC from sources.

Please Log in or Create an account to join the conversation.

CT LAB ver 5.20 8 years 1 day ago #6453

  • avra
  • avra's Avatar
  • Visitor
  • Visitor

arhangelsoft wrote: no, thanks.. I'm already build FPC from sources.


Sorry, but from your sentence "Or how to build FPC from SVN sources?" I thought you didn't know how to do that, so that's why FPCUP utility was proposed as an easiest tool for the task.

Please Log in or Create an account to join the conversation.

Last edit: by avra.

CT LAB ver 5.20 8 years 1 day ago #6454

  • Alexandr
  • Alexandr's Avatar
  • Offline
  • Junior Member
  • Junior Member
  • Posts: 62
  • Thank you received: 2
I fogot about FPCUP :)

To moderator: Please, clean up thread.

Please Log in or Create an account to join the conversation.

CT LAB ver 5.20 8 years 1 day ago #6455

  • Alexandr
  • Alexandr's Avatar
  • Offline
  • Junior Member
  • Junior Member
  • Posts: 62
  • Thank you received: 2
Nope, now it doesn't work!

I've build FPC 2.7.1 from sources, removed 2.6.4 files from D:\FPC\2.6.4\, than copy 2.7.1 files to it.
After that run Setup.bat from CideTyphon, then select remove and build all.

After few minutes, CT 5.20 is running.
But typhon not compiled...
I tried do it again, the result attched.
Free Pascal Compiler version 2.7.1 [2014/12/03] for i386
Copyright (c) 1993-2014 by Florian Klaempfl and others
(1002) Target OS: Win32 for i386
(3104) Compiling fpvectorialpkg.pas
(3104) Compiling fpvectorial.pas
C:\codetyphon\typhon\components\fpvectorial\fpvectorial.pas(1690,18) Warning: (5033) Function result does not seem to be set
C:\codetyphon\typhon\components\fpvectorial\fpvectorial.pas(1159,36) Hint: (5024) Parameter "ADest" not used
C:\codetyphon\typhon\components\fpvectorial\fpvectorial.pas(2005,24) Note: (5025) Local variable "lT2" not used
C:\codetyphon\typhon\components\fpvectorial\fpvectorial.pas(2100,3) Note: (5025) Local variable "MajorAxis" not used
C:\codetyphon\typhon\components\fpvectorial\fpvectorial.pas(2100,14) Note: (5025) Local variable "MinorAxis" not used
C:\codetyphon\typhon\components\fpvectorial\fpvectorial.pas(365,43) Hint: (5024) Parameter "ADest" not used
C:\codetyphon\typhon\components\fpvectorial\fpvectorial.pas(2235,3) Note: (5027) Local variable "lPosX" is assigned but never used
C:\codetyphon\typhon\components\fpvectorial\fpvectorial.pas(284,20) Hint: (5024) Parameter "ADeltaX" not used
C:\codetyphon\typhon\components\fpvectorial\fpvectorial.pas(284,29) Hint: (5024) Parameter "ADeltaY" not used
C:\codetyphon\typhon\components\fpvectorial\fpvectorial.pas(285,22) Hint: (5024) Parameter "AAngle" not used
C:\codetyphon\typhon\components\fpvectorial\fpvectorial.pas(285,38) Hint: (5024) Parameter "ABase" not used
C:\codetyphon\typhon\components\fpvectorial\fpvectorial.pas(286,36) Hint: (5024) Parameter "ADest" not used
C:\codetyphon\typhon\components\fpvectorial\fpvectorial.pas(398,24) Hint: (5024) Parameter "APage" not used
C:\codetyphon\typhon\components\fpvectorial\fpvectorial.pas(402,36) Hint: (5024) Parameter "ADest" not used
C:\codetyphon\typhon\components\fpvectorial\fpvectorial.pas(2393,59) Hint: (5057) Local variable "lBottom" does not seem to be initialized
C:\codetyphon\typhon\components\fpvectorial\fpvectorial.pas(2393,50) Hint: (5057) Local variable "lRight" does not seem to be initialized
C:\codetyphon\typhon\components\fpvectorial\fpvectorial.pas(2393,42) Hint: (5057) Local variable "lTop" does not seem to be initialized
C:\codetyphon\typhon\components\fpvectorial\fpvectorial.pas(2393,36) Hint: (5057) Local variable "lLeft" does not seem to be initialized
C:\codetyphon\typhon\components\fpvectorial\fpvectorial.pas(406,26) Hint: (5024) Parameter "APos" not used
C:\codetyphon\typhon\components\fpvectorial\fpvectorial.pas(406,44) Hint: (5024) Parameter "ASubpart" not used
C:\codetyphon\typhon\components\fpvectorial\fpvectorial.pas(408,27) Hint: (5024) Parameter "ADeltaX" not used
C:\codetyphon\typhon\components\fpvectorial\fpvectorial.pas(408,36) Hint: (5024) Parameter "ADeltaY" not used
C:\codetyphon\typhon\components\fpvectorial\fpvectorial.pas(408,53) Hint: (5024) Parameter "ASubpart" not used
C:\codetyphon\typhon\components\fpvectorial\fpvectorial.pas(410,32) Hint: (5024) Parameter "ADest" not used
C:\codetyphon\typhon\components\fpvectorial\fpvectorial.pas(410,56) Hint: (5024) Parameter "ABaseX" not used
C:\codetyphon\typhon\components\fpvectorial\fpvectorial.pas(410,64) Hint: (5024) Parameter "ABaseY" not used
C:\codetyphon\typhon\components\fpvectorial\fpvectorial.pas(411,21) Hint: (5024) Parameter "ADeltaScaleX" not used
C:\codetyphon\typhon\components\fpvectorial\fpvectorial.pas(411,35) Hint: (5024) Parameter "ADeltaScaleY" not used
C:\codetyphon\typhon\components\fpvectorial\fpvectorial.pas(412,22) Hint: (5024) Parameter "AAngle" not used
C:\codetyphon\typhon\components\fpvectorial\fpvectorial.pas(412,38) Hint: (5024) Parameter "ABase" not used
C:\codetyphon\typhon\components\fpvectorial\fpvectorial.pas(413,22) Hint: (5024) Parameter "ADest" not used
C:\codetyphon\typhon\components\fpvectorial\fpvectorial.pas(413,50) Hint: (5024) Parameter "ARenderInfo" not used
C:\codetyphon\typhon\components\fpvectorial\fpvectorial.pas(413,77) Hint: (5024) Parameter "ADestX" not used
C:\codetyphon\typhon\components\fpvectorial\fpvectorial.pas(414,7) Hint: (5024) Parameter "ADestY" not used
C:\codetyphon\typhon\components\fpvectorial\fpvectorial.pas(414,28) Hint: (5024) Parameter "AMulX" not used
C:\codetyphon\typhon\components\fpvectorial\fpvectorial.pas(414,49) Hint: (5024) Parameter "AMulY" not used
C:\codetyphon\typhon\components\fpvectorial\fpvectorial.pas(2592,3) Note: (5025) Local variable "lCurPathSeg" not used
C:\codetyphon\typhon\components\fpvectorial\fpvectorial.pas(2622,3) Note: (5025) Local variable "i" not used
C:\codetyphon\typhon\components\fpvectorial\fpvectorial.pas(2627,3) Note: (5025) Local variable "LowerDim" not used
C:\codetyphon\typhon\components\fpvectorial\fpvectorial.pas(2676,3) Note: (5025) Local variable "lCurPathSeg" not used
C:\codetyphon\typhon\components\fpvectorial\fpvectorial.pas(2833,3) Note: (5027) Local variable "L" is assigned but never used
C:\codetyphon\typhon\components\fpvectorial\fpvectorial.pas(2932,16) Warning: (4044) Comparison might be always false due to range of constant and expression
C:\codetyphon\typhon\components\fpvectorial\fpvectorial.pas(2932,34) Hint: (4035) Mixing signed expressions and longwords gives a 64bit result
C:\codetyphon\typhon\components\fpvectorial\fpvectorial.pas(2946,16) Warning: (4044) Comparison might be always false due to range of constant and expression
C:\codetyphon\typhon\components\fpvectorial\fpvectorial.pas(2946,34) Hint: (4035) Mixing signed expressions and longwords gives a 64bit result
C:\codetyphon\typhon\components\fpvectorial\fpvectorial.pas(2950,16) Hint: (4035) Mixing signed expressions and longwords gives a 64bit result
C:\codetyphon\typhon\components\fpvectorial\fpvectorial.pas(2954,57) Hint: (4035) Mixing signed expressions and longwords gives a 64bit result
C:\codetyphon\typhon\components\fpvectorial\fpvectorial.pas(2954,57) Hint: (4079) Converting the operands to "Int64" before doing the add could prevent overflow errors.
C:\codetyphon\typhon\components\fpvectorial\fpvectorial.pas(2960,57) Hint: (4035) Mixing signed expressions and longwords gives a 64bit result
C:\codetyphon\typhon\components\fpvectorial\fpvectorial.pas(2960,57) Hint: (4080) Converting the operands to "Int64" before doing the subtract could prevent overflow errors.
C:\codetyphon\typhon\components\fpvectorial\fpvectorial.pas(3191,92) Hint: (5057) Local variable "BoxBottom" does not seem to be initialized
C:\codetyphon\typhon\components\fpvectorial\fpvectorial.pas(3191,81) Hint: (5057) Local variable "BoxRight" does not seem to be initialized
C:\codetyphon\typhon\components\fpvectorial\fpvectorial.pas(3191,71) Hint: (5057) Local variable "BoxTop" does not seem to be initialized
C:\codetyphon\typhon\components\fpvectorial\fpvectorial.pas(3191,63) Hint: (5057) Local variable "BoxLeft" does not seem to be initialized
C:\codetyphon\typhon\components\fpvectorial\fpvectorial.pas(3012,6) Note: (5025) Local variable "k" not used
C:\codetyphon\typhon\components\fpvectorial\fpvectorial.pas(3020,3) Note: (5025) Local variable "CurX" not used
C:\codetyphon\typhon\components\fpvectorial\fpvectorial.pas(3020,9) Note: (5025) Local variable "CurY" not used
C:\codetyphon\typhon\components\fpvectorial\fpvectorial.pas(3022,3) Note: (5025) Local variable "CurveLength" not used
C:\codetyphon\typhon\components\fpvectorial\fpvectorial.pas(3023,3) Note: (5025) Local variable "t" not used
C:\codetyphon\typhon\components\fpvectorial\fpvectorial.pas(3262,6) Note: (5025) Local variable "k" not used
C:\codetyphon\typhon\components\fpvectorial\fpvectorial.pas(3266,3) Hint: (5028) Local absolutevar "Cur2DBSegment" is not used
C:\codetyphon\typhon\components\fpvectorial\fpvectorial.pas(3267,3) Hint: (5028) Local absolutevar "Cur2DArcSegment" is not used
C:\codetyphon\typhon\components\fpvectorial\fpvectorial.pas(529,61) Hint: (5024) Parameter "ARenderInfo" not used
C:\codetyphon\typhon\components\fpvectorial\fpvectorial.pas(552,44) Hint: (5024) Parameter "ASubpart" not used
C:\codetyphon\typhon\components\fpvectorial\fpvectorial.pas(3395,38) Hint: (5057) Local variable "lRenderInfo" does not seem to be initialized
C:\codetyphon\typhon\components\fpvectorial\fpvectorial.pas(612,36) Hint: (5024) Parameter "ADest" not used
C:\codetyphon\typhon\components\fpvectorial\fpvectorial.pas(3694,49) Hint: (5057) Local variable "fy2" does not seem to be initialized
C:\codetyphon\typhon\components\fpvectorial\fpvectorial.pas(3694,44) Hint: (5057) Local variable "fx2" does not seem to be initialized
C:\codetyphon\typhon\components\fpvectorial\fpvectorial.pas(3694,39) Hint: (5057) Local variable "fy1" does not seem to be initialized
C:\codetyphon\typhon\components\fpvectorial\fpvectorial.pas(3694,34) Hint: (5057) Local variable "fx1" does not seem to be initialized
C:\codetyphon\typhon\components\fpvectorial\fpvectorial.pas(627,36) Hint: (5024) Parameter "ADest" not used
C:\codetyphon\typhon\components\fpvectorial\fpvectorial.pas(3758,49) Hint: (5057) Local variable "fy2" does not seem to be initialized
C:\codetyphon\typhon\components\fpvectorial\fpvectorial.pas(3758,44) Hint: (5057) Local variable "fx2" does not seem to be initialized
C:\codetyphon\typhon\components\fpvectorial\fpvectorial.pas(3758,39) Hint: (5057) Local variable "fy1" does not seem to be initialized
C:\codetyphon\typhon\components\fpvectorial\fpvectorial.pas(3758,34) Hint: (5057) Local variable "fx1" does not seem to be initialized
C:\codetyphon\typhon\components\fpvectorial\fpvectorial.pas(3778,3) Note: (5025) Local variable "lCurPathSeg" not used
C:\codetyphon\typhon\components\fpvectorial\fpvectorial.pas(3855,3) Hint: (5028) Local absolutevar "ALCLDest" is not used
C:\codetyphon\typhon\components\fpvectorial\fpvectorial.pas(3954,3) Note: (5025) Local variable "lCurPathSeg" not used
C:\codetyphon\typhon\components\fpvectorial\fpvectorial.pas(3986,3) Hint: (5028) Local absolutevar "ALCLDest" is not used
C:\codetyphon\typhon\components\fpvectorial\fpvectorial.pas(4064,3) Note: (5025) Local variable "lCurPathSeg" not used
C:\codetyphon\typhon\components\fpvectorial\fpvectorial.pas(4096,3) Note: (5025) Local variable "lAngleLeft" not used
C:\codetyphon\typhon\components\fpvectorial\fpvectorial.pas(4096,15) Note: (5025) Local variable "lAngleRight" not used
C:\codetyphon\typhon\components\fpvectorial\fpvectorial.pas(692,50) Hint: (5024) Parameter "ARenderInfo" not used
C:\codetyphon\typhon\components\fpvectorial\fpvectorial.pas(4181,9) Note: (5025) Local variable "lIsDiameterStr" not used
C:\codetyphon\typhon\components\fpvectorial\fpvectorial.pas(4182,3) Note: (5025) Local variable "lCurPathSeg" not used
C:\codetyphon\typhon\components\fpvectorial\fpvectorial.pas(721,50) Hint: (5024) Parameter "ARenderInfo" not used
C:\codetyphon\typhon\components\fpvectorial\fpvectorial.pas(758,36) Hint: (5024) Parameter "ADest" not used
C:\codetyphon\typhon\components\fpvectorial\fpvectorial.pas(758,64) Hint: (5024) Parameter "ALeft" not used
C:\codetyphon\typhon\components\fpvectorial\fpvectorial.pas(758,71) Hint: (5024) Parameter "ATop" not used
C:\codetyphon\typhon\components\fpvectorial\fpvectorial.pas(758,77) Hint: (5024) Parameter "ARight" not used
C:\codetyphon\typhon\components\fpvectorial\fpvectorial.pas(758,85) Hint: (5024) Parameter "ABottom" not used
C:\codetyphon\typhon\components\fpvectorial\fpvectorial.pas(813,56) Hint: (5024) Parameter "ABaseX" not used
C:\codetyphon\typhon\components\fpvectorial\fpvectorial.pas(813,64) Hint: (5024) Parameter "ABaseY" not used
C:\codetyphon\typhon\components\fpvectorial\fpvectorial.pas(826,42) Hint: (5024) Parameter "arg" not used
C:\codetyphon\typhon\components\fpvectorial\fpvectorial.pas(4915,22) Note: (5025) Local variable "FCommaSeparator" not used
C:\codetyphon\typhon\components\fpvectorial\fpvectorial.pas(4946,3) Note: (5025) Local variable "lFirstTmpStrChar" not used
C:\codetyphon\typhon\components\fpvectorial\fpvectorial.pas(5077,3) Note: (5027) Local variable "lPosY" is assigned but never used
C:\codetyphon\typhon\components\fpvectorial\fpvectorial.pas(879,42) Hint: (5024) Parameter "arg" not used
C:\codetyphon\typhon\components\fpvectorial\fpvectorial.pas(5375,3) Note: (5025) Local variable "lEntity" not used
C:\codetyphon\typhon\components\fpvectorial\fpvectorial.pas(5490,69) Hint: (5057) Local variable "lBottom" does not seem to be initialized
C:\codetyphon\typhon\components\fpvectorial\fpvectorial.pas(5490,60) Hint: (5057) Local variable "lRight" does not seem to be initialized
C:\codetyphon\typhon\components\fpvectorial\fpvectorial.pas(5490,52) Hint: (5057) Local variable "lTop" does not seem to be initialized
C:\codetyphon\typhon\components\fpvectorial\fpvectorial.pas(5490,46) Hint: (5057) Local variable "lLeft" does not seem to be initialized
C:\codetyphon\typhon\components\fpvectorial\fpvectorial.pas(5477,3) Hint: (5028) Local absolutevar "ACanvas" is not used
C:\codetyphon\typhon\components\fpvectorial\fpvectorial.pas(5551,69) Hint: (5057) Local variable "lBottom" does not seem to be initialized
C:\codetyphon\typhon\components\fpvectorial\fpvectorial.pas(5551,60) Hint: (5057) Local variable "lRight" does not seem to be initialized
C:\codetyphon\typhon\components\fpvectorial\fpvectorial.pas(5551,52) Hint: (5057) Local variable "lTop" does not seem to be initialized
C:\codetyphon\typhon\components\fpvectorial\fpvectorial.pas(5551,46) Hint: (5057) Local variable "lLeft" does not seem to be initialized
C:\codetyphon\typhon\components\fpvectorial\fpvectorial.pas(5689,74) Hint: (5057) Local variable "lBottom" does not seem to be initialized
C:\codetyphon\typhon\components\fpvectorial\fpvectorial.pas(5689,65) Hint: (5057) Local variable "lRight" does not seem to be initialized
C:\codetyphon\typhon\components\fpvectorial\fpvectorial.pas(5689,57) Hint: (5057) Local variable "lTop" does not seem to be initialized
C:\codetyphon\typhon\components\fpvectorial\fpvectorial.pas(5689,51) Hint: (5057) Local variable "lLeft" does not seem to be initialized
C:\codetyphon\typhon\components\fpvectorial\fpvectorial.pas(1256,22) Hint: (5024) Parameter "ASource" not used
C:\codetyphon\typhon\components\fpvectorial\fpvectorial.pas(5751,78) Hint: (5057) Local variable "lBottom" does not seem to be initialized
C:\codetyphon\typhon\components\fpvectorial\fpvectorial.pas(5751,69) Hint: (5057) Local variable "lRight" does not seem to be initialized
C:\codetyphon\typhon\components\fpvectorial\fpvectorial.pas(5751,61) Hint: (5057) Local variable "lTop" does not seem to be initialized
C:\codetyphon\typhon\components\fpvectorial\fpvectorial.pas(5751,55) Hint: (5057) Local variable "lLeft" does not seem to be initialized
C:\codetyphon\typhon\components\fpvectorial\fpvectorial.pas(5766,3) Note: (5025) Local variable "segment" not used
C:\codetyphon\typhon\components\fpvectorial\fpvectorial.pas(5766,12) Note: (5025) Local variable "oldsegment" not used
C:\codetyphon\typhon\components\fpvectorial\fpvectorial.pas(1293,41) Hint: (5024) Parameter "arg" not used
C:\codetyphon\typhon\components\fpvectorial\fpvectorial.pas(5832,11) Hint: (4035) Mixing signed expressions and longwords gives a 64bit result
C:\codetyphon\typhon\components\fpvectorial\fpvectorial.pas(5870,48) Hint: (5057) Local variable "lSubpart" does not seem to be initialized
C:\codetyphon\typhon\components\fpvectorial\fpvectorial.pas(5928,13) Hint: (4035) Mixing signed expressions and longwords gives a 64bit result
C:\codetyphon\typhon\components\fpvectorial\fpvectorial.pas(5968,3) Note: (5025) Local variable "Len" not used
C:\codetyphon\typhon\components\fpvectorial\fpvectorial.pas(1338,46) Hint: (5024) Parameter "AZ" not used
C:\codetyphon\typhon\components\fpvectorial\fpvectorial.pas(1339,32) Hint: (5024) Parameter "AZ" not used
C:\codetyphon\typhon\components\fpvectorial\fpvectorial.pas(6523,29) Warning: (5033) Function result does not seem to be set
C:\codetyphon\typhon\components\fpvectorial\fpvectorial.pas(1382,35) Hint: (5024) Parameter "Pos" not used
C:\codetyphon\typhon\components\fpvectorial\fpvectorial.pas(6529,29) Warning: (5033) Function result does not seem to be set
C:\codetyphon\typhon\components\fpvectorial\fpvectorial.pas(1383,41) Hint: (5024) Parameter "AName" not used
C:\codetyphon\typhon\components\fpvectorial\fpvectorial.pas(1383,56) Hint: (5024) Parameter "AType" not used
C:\codetyphon\typhon\components\fpvectorial\fpvectorial.pas(1383,91) Hint: (5024) Parameter "ARecursively" not used
C:\codetyphon\typhon\components\fpvectorial\fpvectorial.pas(6545,29) Warning: (5033) Function result does not seem to be set
C:\codetyphon\typhon\components\fpvectorial\fpvectorial.pas(1387,28) Hint: (5024) Parameter "AEntity" not used
C:\codetyphon\typhon\components\fpvectorial\fpvectorial.pas(1387,47) Hint: (5024) Parameter "AFreeAfterRemove" not used
C:\codetyphon\typhon\components\fpvectorial\fpvectorial.pas(1397,30) Hint: (5024) Parameter "ADest" not used
C:\codetyphon\typhon\components\fpvectorial\fpvectorial.pas(1398,32) Hint: (5024) Parameter "ADest" not used
C:\codetyphon\typhon\components\fpvectorial\fpvectorial.pas(1399,7) Hint: (5024) Parameter "ADestX" not used
C:\codetyphon\typhon\components\fpvectorial\fpvectorial.pas(1399,28) Hint: (5024) Parameter "ADestY" not used
C:\codetyphon\typhon\components\fpvectorial\fpvectorial.pas(1399,49) Hint: (5024) Parameter "AMulX" not used
C:\codetyphon\typhon\components\fpvectorial\fpvectorial.pas(1399,70) Hint: (5024) Parameter "AMulY" not used
C:\codetyphon\typhon\components\fpvectorial\fpvectorial.pas(6623,97) Hint: (5057) Local variable "lBoundsBottom" does not seem to be initialized
C:\codetyphon\typhon\components\fpvectorial\fpvectorial.pas(6623,82) Hint: (5057) Local variable "lBoundsRight" does not seem to be initialized
C:\codetyphon\typhon\components\fpvectorial\fpvectorial.pas(6623,68) Hint: (5057) Local variable "lBoundsTop" does not seem to be initialized
C:\codetyphon\typhon\components\fpvectorial\fpvectorial.pas(6623,56) Hint: (5057) Local variable "lBoundsLeft" does not seem to be initialized
C:\codetyphon\typhon\components\fpvectorial\fpvectorial.pas(1195,22) Hint: (5024) Parameter "ASource" not used
C:\codetyphon\typhon\components\fpvectorial\fpvectorial.pas(6910,31) Warning: (5033) Function result does not seem to be set
Fatal: (1024) I/O error: File not open
make[2]: *** [fpvectorialpkg.ppu] Error 1
make[2]: Leaving directory `C:/codetyphon/typhon/components/fpvectorial'
make[1]: *** [bigide] Error 2
make[1]: Leaving directory `C:/codetyphon/typhon/components'
make: *** [bigidecomponents] Error 2

------------------------------------------------------

??????????????????????????????????????????????????????
[ERROR]: Typhon64 BIG-IDE IDE NOT Build
??????????????????????????????????????????????????????  

Buit rebuilding IDE from itself, gets good result.
Also: Bug with GlassDocking XML still exists.

CT: 5.20
FPC: 2.7.1
Attachments:

Please Log in or Create an account to join the conversation.

Last edit: by Alexandr.

CT LAB ver 5.20 8 years 1 day ago #6458

  • zbyna
  • zbyna's Avatar
  • Offline
  • Junior Member
  • Junior Member
  • Posts: 33
  • Thank you received: 2

sternas wrote:



---- CT Release 5.20 LAB Tasks list ----
...
02-12-2014 Revision: 005131 LAB Actions
...
Note1: You can download and test this version from "CTCenter->Update Manager" and select CT Development Version
Note2: Please post to this topic any suggestion or problem or fix for LAB CT ver 5.20


Any direct download link for CodeTyphonIns.zip with Development version ? I would like to test on Mac but there is no usable CTCenter from previous stable version.
Thanks for hint
zbyna

Please Log in or Create an account to join the conversation.

CT LAB ver 5.20 8 years 4 hours ago #6464

  • usbdoo
  • usbdoo's Avatar
  • Visitor
  • Visitor
Please add this in CodeTyphon.
IBX For Lazarus (Firebird Express).
www.mwasoftware.co.uk/index.php?option=c...ew&id=102&Itemid=133


I tested on Linux and windows,
Work without problems.

Please Log in or Create an account to join the conversation.

Last edit: by usbdoo.
  • Page:
  • 1
  • 2